{"text_format":"1","workbook":"xlsx","n_sheets":28,"sheets":["General data","XBRL Errors","Index","Show","Hierarchies","T01.01","T01.02","T01.03","T01.04","T02.01","T02.02","T02.03","T03.01","T04.01","T04.02","T05.01","T05.02","T05.03","T06.01","T06.02","T06.03","T07.01","T07.02","T08.01","T08.02","T09.01","T09.02","T09.03"],"not_rendered":{"charts":0,"images":3,"macros":1,"external_links":0,"defined_names":41,"comments":0,"pivot_tables":0},"unopened":[],"bounds":{"document_bytes":16777216,"sheet_cells":100000,"rows_first":2000,"rows_last":500,"rows_between":2000,"halvings":0,"cell_chars":16384,"cell_head_chars":4096},"cells_cut":0,"cells_raw":0,"read":"whole","date_system":"1900"}

{"sheet":"General data","index":0,"n_rows":247,"n_cols":23,"rows_kept":247,"cut":false,"hidden":false,"merged":[[0,6,2,6],[3,0,5,9]]}
[null,null,null,null,null,null,null,"Version:",null,"2.0.0.1",null,null,null,null,null,null,"Not applicable/All geographical areas","http://standards.iso.org/iso/17442","Module with all tables","PAY-ALL","01","EUR","NL PAY 2.0.0"]
[null,null,null,null,null,null,null,null,null,null,null,null,null,null,null,null,"AFGHANISTAN","http://standards.iso.org/iso/17442","Payments Statistics - Core half-yearly","PAY-CH","12","AED"]
[null,null,null,null,null,null,null," ",null,null,null,null,null,null,null,null,"ALBANIA","http://standards.iso.org/iso/17442","Payment Statistics - Core quarterly","PAY-CQ","13","AFN"]
[null,null,null,null,null,null,null,null,null,null,null,null,null,null,null,null,"ALGERIA","http://standards.iso.org/iso/17442","Payments Statistics - Derogation","PAY-D","14","ALL"]
[null,null,null,null,null,null,null,null,null,null,null,null,null,null,null,null,"AMERICAN SAMOA","http://standards.iso.org/iso/17442","Payments Statistics - LVPS","PAY-PSO-L","15","AMD"]
[null,null,null,null,null,null,null,null,null,null,null,null,null,null,null,null,"ANDORRA","http://standards.iso.org/iso/17442","Payments Statistics - RPS","PAY-PSO-R","16","ANG"]
[null,null,null,null,null,null,null,null,null,null,null,null,null,null,null,null,"ANGOLA","http://standards.iso.org/iso/17442","Payments Statistics - TARGET2/NCB","PAY-T2-NCB","17","AOA"]
[null,"General Data",null,null,null,null,null,null,null,null,null,"/General data label{B}","/General data value{E}",null,null,null,"ANGUILLA","http://standards.iso.org/iso/17442",null,null,"18","ARS"]
[null,null,null,null,null,null,null,null,null,null,null,null,null,null,null,null,"ANTARCTICA","http://standards.iso.org/iso/17442",null,null,"19","AUD"]
["*","Identifier",":","LEGALIDENTIFIER20POS",{"$f":"\"\"&D10","v":"LEGALIDENTIFIER20POS"},{"$f":"IF(D10=\"\",1,0)","v":0},null,null,null,null,null,null,null,null,null,null,"ANTIGUA AND BARBUDA","http://standards.iso.org/iso/17442",null,null,"20","AWG"]
{"$rows_left_out":238}
{"sheet":"XBRL Errors","index":1,"n_rows":19,"n_cols":2,"rows_kept":19,"cut":false,"hidden":false,"merged":[]}
["Timestamp","Error"]
["2024-01-05T18:36:27","FILING RULE ERROR S 2.8.(c): inappropriateSchemeOrIdentifier: If scheme 'http://standards.iso.org/iso/17442' or scheme 'LEI' has been used, the identifier must be a valid LEI-code. Please use the national identifierScheme when reporting with a national Identifier."]
[]
["2024-01-05T18:35:32","FILING RULE ERROR S 2.8.(c): inappropriateSchemeOrIdentifier: If scheme 'http://standards.iso.org/iso/17442' or scheme 'LEI' has been used, the identifier must be a valid LEI-code. Please use the national identifierScheme when reporting with a national Identifier."]
[]
["2024-01-04T14:35:54","FILING RULE ERROR S 2.8.(c): inappropriateSchemeOrIdentifier: If scheme 'http://standards.iso.org/iso/17442' or scheme 'LEI' has been used, the identifier must be a valid LEI-code. Please use the national identifierScheme when reporting with a national Identifier."]
[]
["2024-01-04T13:58:18","FILING RULE ERROR S 2.8.(c): inappropriateSchemeOrIdentifier: If scheme 'http://standards.iso.org/iso/17442' or scheme 'LEI' has been used, the identifier must be a valid LEI-code. Please use the national identifierScheme when reporting with a national Identifier."]
["2024-01-04T13:58:18","In context 'xbrli:context id=\"ctx-1\"', primary item 'dnb_met:ii003' contains invalid hypercubes in all base sets."]
["2024-01-04T13:58:18","In context 'xbrli:context id=\"ctx-1\"', values 'dnb_dom030:mem014' and 'dnb_dom030:mem034' are reported for the same dimension 'dnb_dim:dim044'."]
{"$rows_left_out":10}
{"sheet":"Index","index":2,"n_rows":28,"n_cols":5,"rows_kept":28,"cut":false,"hidden":false,"merged":[[2,1,2,14]]}
[]
[]
[null,"Index"]
[]
[null,"Template Code","Template Name","Reporting Status"]
[null,"T01.01","T01.01 Payment transactions involving non-MFIs, sent; card-based transactions",null,{"$f":"IF($D$6=\"Reported\",\"@ForceFilingCode:true\",IF($D$6=\"Not Reported\",\"@ForceFilingCode:false\",\"\"))","v":""}]
[null,"T01.02","T01.02 Payment transactions involving non-MFIs, sent; other transactions",null,{"$f":"IF($D$7=\"Reported\",\"@ForceFilingCode:true\",IF($D$7=\"Not Reported\",\"@ForceFilingCode:false\",\"\"))","v":""}]
[null,"T01.03","T01.03 Payment transactions involving non-MFIs, received; card-based transactions",null,{"$f":"IF($D$8=\"Reported\",\"@ForceFilingCode:true\",IF($D$8=\"Not Reported\",\"@ForceFilingCode:false\",\"\"))","v":""}]
[null,"T01.04","T01.04 Payment transactions involving non-MFIs, received; other transactions",null,{"$f":"IF($D$9=\"Reported\",\"@ForceFilingCode:true\",IF($D$9=\"Not Reported\",\"@ForceFilingCode:false\",\"\"))","v":""}]
[null,"T02.01","T02.01 Payment transactions involving non-MFIs, sent; card-based transactions - Derogation",null,{"$f":"IF($D$10=\"Reported\",\"@ForceFilingCode:true\",IF($D$10=\"Not Reported\",\"@ForceFilingCode:false\",\"\"))","v":""}]
{"$rows_left_out":19}
{"sheet":"Show","index":3,"n_rows":48,"n_cols":9,"rows_kept":48,"cut":false,"hidden":true,"merged":[]}
["Sheet","Prefix","PAY-ALL","PAY-CH","PAY-CQ","PAY-D","PAY-PSO-L","PAY-PSO-R","PAY-T2-NCB"]
["T01.01",{"$f":"IF(AND(HLOOKUP('General data'!$E$22,$C$1:$J$2,2,FALSE)=\"X\",Index!D6=\"Reported\"),\"/\",\"!\")","v":"!"},"X","X"]
["T01.02",{"$f":"IF(AND(HLOOKUP('General data'!$E$22,$C$1:$J$3,3,FALSE)=\"X\",Index!D7=\"Reported\"),\"/\",\"!\")","v":"!"},"X","X"]
["T01.03",{"$f":"IF(AND(HLOOKUP('General data'!$E$22,$C$1:$J$4,4,FALSE)=\"X\",Index!D8=\"Reported\"),\"/\",\"!\")","v":"!"},"X","X"]
["T01.04",{"$f":"IF(AND(HLOOKUP('General data'!$E$22,$C$1:$J$5,5,FALSE)=\"X\",Index!D9=\"Reported\"),\"/\",\"!\")","v":"!"},"X","X"]
["T02.01",{"$f":"IF(AND(HLOOKUP('General data'!$E$22,$C$1:$J$6,6,FALSE)=\"X\",Index!D10=\"Reported\"),\"/\",\"!\")","v":"!"},"X",null,null,"X"]
["T02.02",{"$f":"IF(AND(HLOOKUP('General data'!$E$22,$C$1:$J$7,7,FALSE)=\"X\",Index!D11=\"Reported\"),\"/\",\"!\")","v":"!"},"X",null,null,"X"]
["T02.03",{"$f":"IF(AND(HLOOKUP('General data'!$E$22,$C$1:$J$8,8,FALSE)=\"X\",Index!D12=\"Reported\"),\"/\",\"!\")","v":"!"},"X",null,null,"X"]
["T03.01",{"$f":"IF(AND(HLOOKUP('General data'!$E$22,$C$1:$J$9,9,FALSE)=\"X\",Index!D13=\"Reported\"),\"/\",\"!\")","v":"!"},"X","X",null,"X"]
["T04.01",{"$f":"IF(AND(HLOOKUP('General data'!$E$22,$C$1:$J$10,10,FALSE)=\"X\",Index!D14=\"Reported\"),\"/\",\"!\")","v":"!"},"X","X",null,"X"]
{"$rows_left_out":39}
{"sheet":"Hierarchies","index":4,"n_rows":339,"n_cols":8,"rows_kept":339,"cut":false,"hidden":true,"merged":[]}
["hier_dom030_099","hier_dom030_022","hier_dom030_027","hier_dom030_027","hier_dom121_002","hier_dom121_002","hier_0","hier_0"]
["2 - Not applicable / All or Total","Not applicable / All or Total","Not applicable / All or Total","Not applicable / All or Total","Not applicable / All or Total","Not applicable / All or Total"]
["2 - Austria","Austria","Afghanistan","Afghanistan","Missing","Missing"]
["2 - Belgium","Belgium","Albania","Albania","742 - Veterinary services","742 - Veterinary services"]
["2 - Bulgaria","Bulgaria","Algeria","Algeria","743 - Wine producers","743 - Wine producers"]
["2 - Croatia","Croatia","American Samoa (East)","American Samoa (East)","744 - Champagne producers","744 - Champagne producers"]
["2 - Cyprus","Cyprus","Andorra","Andorra","763 - Agricultural Cooperatives","763 - Agricultural Cooperatives"]
["2 - Czech Republic","Czech Republic","Angola","Angola","780 - Landscaping and horticultural services","780 - Landscaping and horticultural services"]
["2 - Denmark","Denmark","Anguilla","Anguilla","1353 - Dia (Spain)-Hypermarkets of Food","1353 - Dia (Spain)-Hypermarkets of Food"]
["2 - Estonia","Estonia","Antarctica","Antarctica","1406 - H&M Moda (Spain)-Retail Merchants","1406 - H&M Moda (Spain)-Retail Merchants"]
{"$rows_left_out":330}
{"sheet":"T01.01","index":5,"n_rows":336,"n_cols":20,"rows_kept":336,"cut":false,"hidden":true,"merged":[[13,3,13,5],[13,6,13,8],[13,9,13,11],[13,12,13,14],[1,1,1,14],[4,1,4,11],[10,3,11,14],[12,3,12,8],[12,9,12,14],[14,14,17,14],[14,3,17,3],[14,4,17,4],[14,5,17,5],[14,6,17,6],[14,7,17,7],[14,8,17,8],[14,9,17,9],[14,10,17,10],[14,11,17,11],[14,12,17,12],[14,13,17,13]]}
["Back to Index"]
[null,"Table group: Payment transactions involving non-MFIs - full"]
[]
[]
[null,"T01.01 Payment transactions involving non-MFIs, sent; card-based transactions"]
[]
[null,"Counterparty country/group","Z001",null,null,null,{"$f":"Show!$B$2&\"T01.01 Table label {\"&COLUMN($C$1)&\"}\"","v":"!T01.01 Table label {3}"},{"$f":"Show!$B$2&\"T01.01 Table value {\"&COLUMN($D$1)&\"}\"","v":"!T01.01 Table value {4}"}]
[null,"Terminal location","Z002"]
[null,null,null,null,null,null,{"$f":"Show!$B$2&Show!$B$2&\"T01.01 Table label {\"&COLUMN($C$1)&\"}\"","v":"!!T01.01 Table label {3}"},{"$f":"Show!$B$2&Show!$B$2&\"T01.01 Table value {\"&COLUMN($D$1)&\"}\"","v":"!!T01.01 Table value {4}"}]
[]
{"$rows_left_out":327}
{"sheet":"T01.02","index":6,"n_rows":166,"n_cols":20,"rows_kept":166,"cut":false,"hidden":true,"merged":[[12,3,12,5],[12,6,12,8],[12,9,12,11],[12,12,12,14],[1,1,1,14],[4,1,4,11],[9,3,10,14],[11,3,11,8],[11,9,11,14],[13,14,15,14],[13,3,15,3],[13,4,15,4],[13,5,15,5],[13,6,15,6],[13,7,15,7],[13,8,15,8],[13,9,15,9],[13,10,15,10],[13,11,15,11],[13,12,15,12],[13,13,15,13]]}
["Back to Index"]
[null,"Table group: Payment transactions involving non-MFIs - full"]
[]
[]
[null,"T01.02 Payment transactions involving non-MFIs, sent; other transactions"]
[]
[null,"Counterparty country/group","Z001",null,null,null,{"$f":"Show!$B$3&\"T01.02 Table label {\"&COLUMN($C$1)&\"}\"","v":"!T01.02 Table label {3}"},{"$f":"Show!$B$3&\"T01.02 Table value {\"&COLUMN($D$1)&\"}\"","v":"!T01.02 Table value {4}"}]
[null,null,null,null,null,null,{"$f":"Show!$B$3&Show!$B$3&\"T01.02 Table label {\"&COLUMN($C$1)&\"}\"","v":"!!T01.02 Table label {3}"},{"$f":"Show!$B$3&Show!$B$3&\"T01.02 Table value {\"&COLUMN($D$1)&\"}\"","v":"!!T01.02 Table value {4}"}]
[]
[null,null,null,"x-axis"]
{"$rows_left_out":157}
{"sheet":"T01.03","index":7,"n_rows":237,"n_cols":20,"rows_kept":237,"cut":false,"hidden":true,"merged":[[13,3,13,5],[13,6,13,8],[13,9,13,11],[13,12,13,14],[1,1,1,14],[4,1,4,11],[10,3,11,14],[12,3,12,8],[12,9,12,14],[14,14,17,14],[14,3,17,3],[14,4,17,4],[14,5,17,5],[14,6,17,6],[14,7,17,7],[14,8,17,8],[14,9,17,9],[14,10,17,10],[14,11,17,11],[14,12,17,12],[14,13,17,13]]}
["Back to Index"]
[null,"Table group: Payment transactions involving non-MFIs - full"]
[]
[]
[null,"T01.03 Payment transactions involving non-MFIs, received; card-based transactions"]
[]
[null,"Counterparty country/group","Z001",null,null,null,{"$f":"Show!$B$4&\"T01.03 Table label {\"&COLUMN($C$1)&\"}\"","v":"!T01.03 Table label {3}"},{"$f":"Show!$B$4&\"T01.03 Table value {\"&COLUMN($D$1)&\"}\"","v":"!T01.03 Table value {4}"}]
[null,"Terminal location","Z002"]
[null,null,null,null,null,null,{"$f":"Show!$B$4&Show!$B$4&\"T01.03 Table label {\"&COLUMN($C$1)&\"}\"","v":"!!T01.03 Table label {3}"},{"$f":"Show!$B$4&Show!$B$4&\"T01.03 Table value {\"&COLUMN($D$1)&\"}\"","v":"!!T01.03 Table value {4}"}]
[]
{"$rows_left_out":228}
{"sheet":"T01.04","index":8,"n_rows":24,"n_cols":10,"rows_kept":24,"cut":false,"hidden":true,"merged":[[1,1,1,14],[4,1,4,11],[9,3,10,4],[11,3,11,4]]}
["Back to Index"]
[null,"Table group: Payment transactions involving non-MFIs - full"]
[]
[]
[null,"T01.04 Payment transactions involving non-MFIs, received; other transactions"]
[]
[null,"Counterparty country/group","Z001",null,null,null,{"$f":"Show!$B$5&\"T01.04 Table label {\"&COLUMN($C$1)&\"}\"","v":"!T01.04 Table label {3}"},{"$f":"Show!$B$5&\"T01.04 Table value {\"&COLUMN($D$1)&\"}\"","v":"!T01.04 Table value {4}"}]
[null,null,null,null,null,null,{"$f":"Show!$B$5&Show!$B$5&\"T01.04 Table label {\"&COLUMN($C$1)&\"}\"","v":"!!T01.04 Table label {3}"},{"$f":"Show!$B$5&Show!$B$5&\"T01.04 Table value {\"&COLUMN($D$1)&\"}\"","v":"!!T01.04 Table value {4}"}]
[]
[null,null,null,"x-axis"]
{"$rows_left_out":15}
{"sheet":"T02.01","index":9,"n_rows":67,"n_cols":20,"rows_kept":67,"cut":false,"hidden":true,"merged":[[13,3,13,5],[13,6,13,8],[13,9,13,11],[13,12,13,14],[1,1,1,14],[4,1,4,11],[10,3,11,14],[12,3,12,8],[12,9,12,14],[14,14,16,14],[14,3,16,3],[14,4,16,4],[14,5,16,5],[14,6,16,6],[14,7,16,7],[14,8,16,8],[14,9,16,9],[14,10,16,10],[14,11,16,11],[14,12,16,12],[14,13,16,13]]}
["Back to Index"]
[null,"Table group: Payment transactions involving non-MFIs - derogation specific"]
[]
[]
[null,"T02.01 Payment transactions involving non-MFIs, sent; card-based transactions - Derogation"]
[]
[null,"Counterparty country/group","Z001",null,null,null,{"$f":"Show!$B$6&\"T02.01 Table label {\"&COLUMN($C$1)&\"}\"","v":"!T02.01 Table label {3}"},{"$f":"Show!$B$6&\"T02.01 Table value {\"&COLUMN($D$1)&\"}\"","v":"!T02.01 Table value {4}"}]
[null,"Terminal location","Z002"]
[null,null,null,null,null,null,{"$f":"Show!$B$6&Show!$B$6&\"T02.01 Table label {\"&COLUMN($C$1)&\"}\"","v":"!!T02.01 Table label {3}"},{"$f":"Show!$B$6&Show!$B$6&\"T02.01 Table value {\"&COLUMN($D$1)&\"}\"","v":"!!T02.01 Table value {4}"}]
[]
{"$rows_left_out":58}
{"sheet":"T02.02","index":10,"n_rows":95,"n_cols":20,"rows_kept":95,"cut":false,"hidden":true,"merged":[[12,3,12,5],[12,6,12,8],[12,9,12,11],[12,12,12,14],[1,1,1,14],[4,1,4,11],[9,3,10,14],[11,3,11,8],[11,9,11,14],[13,14,14,14],[13,3,14,3],[13,4,14,4],[13,5,14,5],[13,6,14,6],[13,7,14,7],[13,8,14,8],[13,9,14,9],[13,10,14,10],[13,11,14,11],[13,12,14,12],[13,13,14,13]]}
["Back to Index"]
[null,"Table group: Payment transactions involving non-MFIs - derogation specific"]
[]
[]
[null,"T02.02 Payment transactions involving non-MFIs, sent; other transactions - Derogation"]
[]
[null,"Counterparty country/group","Z001",null,null,null,{"$f":"Show!$B$7&\"T02.02 Table label {\"&COLUMN($C$1)&\"}\"","v":"!T02.02 Table label {3}"},{"$f":"Show!$B$7&\"T02.02 Table value {\"&COLUMN($D$1)&\"}\"","v":"!T02.02 Table value {4}"}]
[null,null,null,null,null,null,{"$f":"Show!$B$7&Show!$B$7&\"T02.02 Table label {\"&COLUMN($C$1)&\"}\"","v":"!!T02.02 Table label {3}"},{"$f":"Show!$B$7&Show!$B$7&\"T02.02 Table value {\"&COLUMN($D$1)&\"}\"","v":"!!T02.02 Table value {4}"}]
[]
[null,null,null,"x-axis"]
{"$rows_left_out":86}
{"sheet":"T02.03","index":11,"n_rows":54,"n_cols":20,"rows_kept":54,"cut":false,"hidden":true,"merged":[[13,3,13,5],[13,6,13,8],[13,9,13,11],[13,12,13,14],[1,1,1,14],[4,1,4,11],[10,3,11,14],[12,3,12,8],[12,9,12,14],[14,14,16,14],[14,3,16,3],[14,4,16,4],[14,5,16,5],[14,6,16,6],[14,7,16,7],[14,8,16,8],[14,9,16,9],[14,10,16,10],[14,11,16,11],[14,12,16,12],[14,13,16,13]]}
["Back to Index"]
[null,"Table group: Payment transactions involving non-MFIs - derogation specific"]
[]
[]
[null,"T02.03 Payment transactions involving non-MFIs, received; card-based transactions - Derogation"]
[]
[null,"Counterparty country/group","Z001",null,null,null,{"$f":"Show!$B$8&\"T02.03 Table label {\"&COLUMN($C$1)&\"}\"","v":"!T02.03 Table label {3}"},{"$f":"Show!$B$8&\"T02.03 Table value {\"&COLUMN($D$1)&\"}\"","v":"!T02.03 Table value {4}"}]
[null,"Terminal location","Z002"]
[null,null,null,null,null,null,{"$f":"Show!$B$8&Show!$B$8&\"T02.03 Table label {\"&COLUMN($C$1)&\"}\"","v":"!!T02.03 Table label {3}"},{"$f":"Show!$B$8&Show!$B$8&\"T02.03 Table value {\"&COLUMN($D$1)&\"}\"","v":"!!T02.03 Table value {4}"}]
[]
{"$rows_left_out":45}
{"sheet":"T03.01","index":12,"n_rows":46,"n_cols":9,"rows_kept":46,"cut":false,"hidden":true,"merged":[[1,1,1,14],[4,1,4,11],[8,3,9,3],[10,3,12,3]]}
["Back to Index"]
[null,"Table group: Losses due to fraud"]
[]
[]
[null,"T03.01 Losses due to fraud per liability bearer"]
[]
[]
[]
[null,null,null,"x-axis"]
[]
{"$rows_left_out":37}
{"sheet":"T04.01","index":13,"n_rows":34,"n_cols":15,"rows_kept":34,"cut":false,"hidden":true,"merged":[[11,8,12,8],[11,9,12,9],[1,1,1,14],[4,1,4,11],[8,3,9,9],[10,3,10,7],[10,8,10,9],[11,3,12,3],[11,4,12,4],[11,5,12,5],[11,6,12,6],[11,7,12,7]]}
["Back to Index"]
[null,"Table group: Other payment service provider related information"]
[]
[]
[null,"T04.01 Other payment service provider related information; A"]
[]
[]
[]
[null,null,null,"x-axis"]
[]
{"$rows_left_out":25}
{"sheet":"T04.02","index":14,"n_rows":19,"n_cols":9,"rows_kept":19,"cut":false,"hidden":true,"merged":[[1,1,1,14],[4,1,4,11],[9,3,10,3],[11,3,12,3]]}
["Back to Index"]
[null,"Table group: Other payment service provider related information"]
[]
[]
[null,"T04.02 Other payment service provider related information; B"]
[]
[null,"Counterparty country/group","Z001",null,null,null,{"$f":"Show!$B$11&\"T04.02 Table label {\"&COLUMN($C$1)&\"}\"","v":"!T04.02 Table label {3}"},{"$f":"Show!$B$11&\"T04.02 Table value {\"&COLUMN($D$1)&\"}\"","v":"!T04.02 Table value {4}"}]
[null,null,null,null,null,null,{"$f":"Show!$B$11&Show!$B$11&\"T04.02 Table label {\"&COLUMN($C$1)&\"}\"","v":"!!T04.02 Table label {3}"},{"$f":"Show!$B$11&Show!$B$11&\"T04.02 Table value {\"&COLUMN($D$1)&\"}\"","v":"!!T04.02 Table value {4}"}]
[]
[null,null,null,"x-axis"]
{"$rows_left_out":10}
{"sheet":"T05.01","index":15,"n_rows":37,"n_cols":10,"rows_kept":37,"cut":false,"hidden":true,"merged":[[1,1,1,14],[4,1,4,11],[9,3,10,4],[11,3,12,3],[11,4,12,4]]}
["Back to Index"]
[null,"Table group: Card and terminal related information"]
[]
[]
[null,"T05.01 Payment transactions per type of terminal involving non-MFIs"]
[]
[null,"Terminal location","Z001",null,null,null,{"$f":"Show!$B$12&\"T05.01 Table label {\"&COLUMN($C$1)&\"}\"","v":"!T05.01 Table label {3}"},{"$f":"Show!$B$12&\"T05.01 Table value {\"&COLUMN($D$1)&\"}\"","v":"!T05.01 Table value {4}"}]
[null,null,null,null,null,null,{"$f":"Show!$B$12&Show!$B$12&\"T05.01 Table label {\"&COLUMN($C$1)&\"}\"","v":"!!T05.01 Table label {3}"},{"$f":"Show!$B$12&Show!$B$12&\"T05.01 Table value {\"&COLUMN($D$1)&\"}\"","v":"!!T05.01 Table value {4}"}]
[]
[null,null,null,"x-axis"]
{"$rows_left_out":28}
{"sheet":"T05.02","index":16,"n_rows":54,"n_cols":9,"rows_kept":54,"cut":false,"hidden":true,"merged":[[1,1,1,14],[4,1,4,11],[8,3,9,3],[10,3,13,3]]}
["Back to Index"]
[null,"Table group: Card and terminal related information"]
[]
[]
[null,"T05.02 Card functions"]
[]
[]
[]
[null,null,null,"x-axis"]
[]
{"$rows_left_out":45}
{"sheet":"T05.03","index":17,"n_rows":30,"n_cols":9,"rows_kept":30,"cut":false,"hidden":true,"merged":[[1,1,1,14],[4,1,4,11],[9,3,10,3],[11,3,14,3]]}
["Back to Index"]
[null,"Table group: Card and terminal related information"]
[]
[]
[null,"T05.03 Card accepting devices"]
[]
[null,"Terminal location","Z001",null,null,null,{"$f":"Show!$B$14&\"T05.03 Table label {\"&COLUMN($C$1)&\"}\"","v":"!T05.03 Table label {3}"},{"$f":"Show!$B$14&\"T05.03 Table value {\"&COLUMN($D$1)&\"}\"","v":"!T05.03 Table value {4}"}]
[null,null,null,null,null,null,{"$f":"Show!$B$14&Show!$B$14&\"T05.03 Table label {\"&COLUMN($C$1)&\"}\"","v":"!!T05.03 Table label {3}"},{"$f":"Show!$B$14&Show!$B$14&\"T05.03 Table value {\"&COLUMN($D$1)&\"}\"","v":"!!T05.03 Table value {4}"}]
[]
[null,null,null,"x-axis"]
{"$rows_left_out":21}
{"sheet":"T06.01","index":18,"n_rows":19,"n_cols":14,"rows_kept":19,"cut":false,"hidden":true,"merged":[[1,1,1,14],[4,1,4,11],[9,3,10,8],[11,3,11,8],[12,3,12,5],[12,6,12,8]]}
["Back to Index"]
[null,"Table group: Payment transactions involving non-MFIs, quarterly reporting - full"]
[]
[]
[null,"T06.01 Payment transactions involving non-MFIs, quarterly reporting; sent; card-based transactions"]
[]
[null,"Terminal location","Z001",null,null,null,{"$f":"Show!$B$15&\"T06.01 Table label {\"&COLUMN($C$1)&\"}\"","v":"!T06.01 Table label {3}"},{"$f":"Show!$B$15&\"T06.01 Table value {\"&COLUMN($D$1)&\"}\"","v":"!T06.01 Table value {4}"}]
[null,null,null,null,null,null,{"$f":"Show!$B$15&Show!$B$15&\"T06.01 Table label {\"&COLUMN($C$1)&\"}\"","v":"!!T06.01 Table label {3}"},{"$f":"Show!$B$15&Show!$B$15&\"T06.01 Table value {\"&COLUMN($D$1)&\"}\"","v":"!!T06.01 Table value {4}"}]
[]
[null,null,null,"x-axis"]
{"$rows_left_out":10}
{"sheet":"T06.02","index":19,"n_rows":17,"n_cols":12,"rows_kept":17,"cut":false,"hidden":true,"merged":[[1,1,1,14],[4,1,4,11],[8,1,13,1],[8,2,13,2],[8,3,9,6],[10,3,10,6],[11,3,11,6],[12,3,12,4],[12,5,12,6]]}
["Back to Index"]
[null,"Table group: Payment transactions involving non-MFIs, quarterly reporting - full"]
[]
[]
[null,"T06.02 Payment transactions involving non-MFIs, quarterly reporting; sent; card-based transactions, MCC breakdown"]
[]
[]
[]
[null,"Terminal location","Merchant category","x-axis"]
[]
{"$rows_left_out":8}
{"sheet":"T06.03","index":20,"n_rows":23,"n_cols":14,"rows_kept":23,"cut":false,"hidden":true,"merged":[[1,1,1,14],[4,1,4,11],[9,3,10,8],[11,3,11,8],[12,3,12,5],[12,6,12,8]]}
["Back to Index"]
[null,"Table group: Payment transactions involving non-MFIs, quarterly reporting - full"]
[]
[]
[null,"T06.03 Payment transactions involving non-MFIs, quarterly reporting; sent; other transactions"]
[]
[null,"Counterparty country/group","Z001",null,null,null,{"$f":"Show!$B$17&\"T06.03 Table label {\"&COLUMN($C$1)&\"}\"","v":"!T06.03 Table label {3}"},{"$f":"Show!$B$17&\"T06.03 Table value {\"&COLUMN($D$1)&\"}\"","v":"!T06.03 Table value {4}"}]
[null,null,null,null,null,null,{"$f":"Show!$B$17&Show!$B$17&\"T06.03 Table label {\"&COLUMN($C$1)&\"}\"","v":"!!T06.03 Table label {3}"},{"$f":"Show!$B$17&Show!$B$17&\"T06.03 Table value {\"&COLUMN($D$1)&\"}\"","v":"!!T06.03 Table value {4}"}]
[]
[null,null,null,"x-axis"]
{"$rows_left_out":14}
{"sheet":"T07.01","index":21,"n_rows":28,"n_cols":9,"rows_kept":28,"cut":false,"hidden":true,"merged":[[1,1,1,14],[4,1,4,11],[8,3,9,3],[10,3,13,3]]}
["Back to Index"]
[null,"Table group: Large Value Payment System specific"]
[]
[]
[null,"T07.01 Participation in large value payment system"]
[]
[]
[]
[null,null,null,"x-axis"]
[]
{"$rows_left_out":19}
{"sheet":"T07.02","index":22,"n_rows":30,"n_cols":17,"rows_kept":30,"cut":false,"hidden":true,"merged":[[1,1,1,14],[4,1,4,11],[8,3,9,11],[10,3,10,4],[10,5,10,6],[10,7,10,8],[10,9,10,11],[11,9,12,9],[11,10,12,10],[11,11,12,11],[11,3,12,3],[11,4,12,4],[11,5,12,5],[11,6,12,6],[11,7,12,7],[11,8,12,8]]}
["Back to Index"]
[null,"Table group: Large Value Payment System specific"]
[]
[]
[null,"T07.02 Payments processed by large value payment system"]
[]
[]
[]
[null,null,null,"x-axis"]
[]
{"$rows_left_out":21}
{"sheet":"T08.01","index":23,"n_rows":29,"n_cols":9,"rows_kept":29,"cut":false,"hidden":true,"merged":[[1,1,1,14],[4,1,4,11],[9,3,10,3],[11,3,14,3]]}
["Back to Index"]
[null,"Table group: Retail Payments Systems specific"]
[]
[]
[null,"T08.01 Participation in payment system"]
[]
[null,"Payment system used","Z001",null,null,null,{"$f":"Show!$B$20&\"T08.01 Table label {\"&COLUMN($C$1)&\"}\"","v":"!T08.01 Table label {3}"},{"$f":"Show!$B$20&\"T08.01 Table value {\"&COLUMN($D$1)&\"}\"","v":"!T08.01 Table value {4}"}]
[null,null,null,null,null,null,{"$f":"Show!$B$20&Show!$B$20&\"T08.01 Table label {\"&COLUMN($C$1)&\"}\"","v":"!!T08.01 Table label {3}"},{"$f":"Show!$B$20&Show!$B$20&\"T08.01 Table value {\"&COLUMN($D$1)&\"}\"","v":"!!T08.01 Table value {4}"}]
[]
[null,null,null,"x-axis"]
{"$rows_left_out":20}
{"sheet":"T08.02","index":24,"n_rows":33,"n_cols":17,"rows_kept":33,"cut":false,"hidden":true,"merged":[[1,1,1,14],[4,1,4,11],[9,3,10,11],[11,3,11,4],[11,5,11,6],[11,7,11,8],[11,9,11,11],[12,9,14,9],[12,10,14,10],[12,11,14,11],[12,3,14,3],[12,4,14,4],[12,5,14,5],[12,6,14,6],[12,7,14,7],[12,8,14,8]]}
["Back to Index"]
[null,"Table group: Retail Payments Systems specific"]
[]
[]
[null,"T08.02 Payments processed by retail payments systems"]
[]
[null,"Payment system used","Z001",null,null,null,{"$f":"Show!$B$21&\"T08.02 Table label {\"&COLUMN($C$1)&\"}\"","v":"!T08.02 Table label {3}"},{"$f":"Show!$B$21&\"T08.02 Table value {\"&COLUMN($D$1)&\"}\"","v":"!T08.02 Table value {4}"}]
[null,null,null,null,null,null,{"$f":"Show!$B$21&Show!$B$21&\"T08.02 Table label {\"&COLUMN($C$1)&\"}\"","v":"!!T08.02 Table label {3}"},{"$f":"Show!$B$21&Show!$B$21&\"T08.02 Table value {\"&COLUMN($D$1)&\"}\"","v":"!!T08.02 Table value {4}"}]
[]
[null,null,null,"x-axis"]
{"$rows_left_out":24}
{"sheet":"T09.01","index":25,"n_rows":28,"n_cols":9,"rows_kept":28,"cut":false,"hidden":true,"merged":[[1,1,1,14],[4,1,4,11],[8,3,9,3],[10,3,13,3]]}
["Back to Index"]
[null,"Table group: TARGET2 and National Central Bank"]
[]
[]
[null,"T09.01 Participation in TARGET2 component system"]
[]
[]
[]
[null,null,null,"x-axis"]
[]
{"$rows_left_out":19}
{"sheet":"T09.02","index":26,"n_rows":30,"n_cols":11,"rows_kept":30,"cut":false,"hidden":true,"merged":[[1,1,1,14],[4,1,4,11],[8,3,9,5],[10,3,12,3],[10,4,12,4],[10,5,12,5]]}
["Back to Index"]
[null,"Table group: TARGET2 and National Central Bank"]
[]
[]
[null,"T09.02 Payments processed by TARGET2 component system"]
[]
[]
[]
[null,null,null,"x-axis"]
[]
{"$rows_left_out":21}
{"sheet":"T09.03","index":27,"n_rows":22,"n_cols":10,"rows_kept":22,"cut":false,"hidden":true,"merged":[[1,1,1,14],[4,1,4,11],[8,3,9,4],[10,3,10,4]]}
["Back to Index"]
[null,"Table group: TARGET2 and National Central Bank"]
[]
[]
[null,"T09.03 Other payment service provider related information: National Central Bank"]
[]
[]
[]
[null,null,null,"x-axis"]
[]
{"$rows_left_out":12}